﻿DATE_FDA_FIRST_RECEIVED_REPORT,REPORT_ID,DATE_EVENT,PRODUCT_TYPE,PRODUCT,PRODUCT_CODE,DESCRIPTION,PATIENT_AGE,AGE_UNITS,SEX,CASE_MEDDRA_PREFERRED_TERMS,CASE_OUTCOME
9/30/2023,2023-CFS-010619,,SUSPECT,KODIAK PROTEIN PACKED POWER WAFFLES,3,Bakery Prod/Dough/Mix/Icing,21,year(s),Female,"Abdominal discomfort, Adverse reaction, Food aversion",Other Serious or Important Medical Event
9/30/2023,2023-CFS-010618,,SUSPECT,MELALEUCA PEAK PERFORMANCE TOTAL HEALTHY LONGEVITY 50+,54,Vit/Min/Prot/Unconv Diet(Human/Animal),,,Female,"Dizziness, Hyperhidrosis, Syncope","Other Serious or Important Medical Event, Visited Emergency Room"
9/30/2023,2023-CFS-010617,8/28/2023,SUSPECT,IT WORKS! SLIMMING GUMMIES,54,Vit/Min/Prot/Unconv Diet(Human/Animal),39,year(s),Female,Anaphylactic reaction,"Other Serious or Important Medical Event, Visited Emergency Room, Allergic Reaction"
9/30/2023,2023-CFS-010616,,SUSPECT,MELALEUCA VITALITY FOR LIFE COLLAGEN BOOST,54,Vit/Min/Prot/Unconv Diet(Human/Animal),,,Female,Dyspnoea,"Other Serious or Important Medical Event, Visited Emergency Room"
9/30/2023,2023-CFS-010615,,SUSPECT,VITALITY MULTIVITAMIN & MINERAL MEN,54,Vit/Min/Prot/Unconv Diet(Human/Animal),,,Male,Prostate cancer,"Other Serious or Important Medical Event, Visited a Health Care Provider"
9/30/2023,2023-CFS-010613,,SUSPECT,RESTEZ,54,Vit/Min/Prot/Unconv Diet(Human/Animal),,,Female,"Hypersensitivity, Urticaria","Other Serious or Important Medical Event, Allergic Reaction"
9/30/2023,2023-CFS-010611,,SUSPECT,MELA-OUT MAGNESIUM,54,Vit/Min/Prot/Unconv Diet(Human/Animal),,,Female,"Lip swelling, Pharyngeal swelling",Other Serious or Important Medical Event
9/29/2023,2023-CFS-010608,9/27/2023,SUSPECT,HUY FONG SRIRACHA,27,Dressing/Condiment,27,year(s),Male,"Diarrhoea, Palpitations, Vomiting",Other Serious or Important Medical Event
9/29/2023,2023-CFS-010606,9/18/2023,SUSPECT,VISBIOME LIVE PROBIOTICS,54,Vit/Min/Prot/Unconv Diet(Human/Animal),57,year(s),Female,"Abdominal pain, Gastrointestinal disorder, Nausea",Other Serious or Important Medical Event
9/29/2023,2023-CFS-010588,9/28/2023,SUSPECT,YES TO YES TO COCONUT ENERGIZING COFFEE PEEL-OFF MASK,53,Cosmetics,33,year(s),Female,Burning sensation,Other Outcome
9/29/2023,2023-CFS-010586,9/28/2023,SUSPECT,DARK & LOVELY HAIR DYE,53,Cosmetics,40,year(s),Female,"Alopecia, Hair colour changes, Hair injury",Other Outcome
9/29/2023,2023-CFS-010585,,SUSPECT,HAIR LA VIE CLINICAL FORMULA HAIR VITAMINS,54,Vit/Min/Prot/Unconv Diet(Human/Animal),,,,"Hypersensitivity, Rash","Hospitalization, Other Serious or Important Medical Event, Allergic Reaction"
9/29/2023,2023-CFS-010585,,CONCOMITANT,BIOTIN SUPPLEMENT,54,Vit/Min/Prot/Unconv Diet(Human/Animal),,,,"Hypersensitivity, Rash","Hospitalization, Other Serious or Important Medical Event, Allergic Reaction"
9/29/2023,2023-CFS-010584,9/19/2023,SUSPECT,CENTRUM MULTIGUMMIES WOMEN 50+,54,Vit/Min/Prot/Unconv Diet(Human/Animal),,,Female,"Diarrhoea, Diarrhoea haemorrhagic",Other Serious or Important Medical Event
9/29/2023,2023-CFS-010583,,SUSPECT,COUNTRY LIFE TRIPLE ACTION SHARP THOUGHT,54,Vit/Min/Prot/Unconv Diet(Human/Animal),,,Female,"Eye swelling, Mydriasis","Other Serious or Important Medical Event, Visited Emergency Room"
9/28/2023,2023-CFS-010475,,SUSPECT,SIMILAC PROBIOTIC TRIBLEND,54,Vit/Min/Prot/Unconv Diet(Human/Animal),,,Female,Necrotising colitis,"Other Serious or Important Medical Event, Other Serious Outcome"
9/28/2023,2023-CFS-010474,,SUSPECT,SIMILAC PROBIOTIC TRIBLEND,54,Vit/Min/Prot/Unconv Diet(Human/Animal),,,Female,Necrotising colitis,"Other Serious or Important Medical Event, Other Serious Outcome"
9/28/2023,2023-CFS-010473,,SUSPECT,SIMILAC PROBIOTIC TRIBLEND,54,Vit/Min/Prot/Unconv Diet(Human/Animal),,,Male,Necrotising colitis,"Other Serious or Important Medical Event, Other Serious Outcome"
9/28/2023,2023-CFS-010472,,SUSPECT,SIMILAC PROBIOTIC TRIBLEND,54,Vit/Min/Prot/Unconv Diet(Human/Animal),,,Male,Necrotising colitis,"Other Serious or Important Medical Event, Other Serious Outcome"
9/28/2023,2023-CFS-010471,,SUSPECT,SIMILAC PROBIOTIC TRIBLEND,54,Vit/Min/Prot/Unconv Diet(Human/Animal),,,Female,Necrotising enterocolitis neonatal,"Other Serious or Important Medical Event, Other Serious Outcome"
9/28/2023,2023-CFS-010470,,SUSPECT,SIMILAC PROBIOTIC TRIBLEND,40P,Powder Formula,,,Male,Necrotising colitis,"Other Serious or Important Medical Event, Other Serious Outcome"
9/28/2023,2023-CFS-010469,9/25/2023,SUSPECT,TAZO AWAKE ENGLISH BREAKFAST BLACK TEA,31,Coffee/Tea,58.9,year(s),Male,"Dizziness, Headache, Influenza like illness",Other Serious or Important Medical Event
9/28/2023,2023-CFS-010468,8/12/2023,SUSPECT,XYNGULAR ACCELERATE WITH THERMOLIT,54,Vit/Min/Prot/Unconv Diet(Human/Animal),,,Female,"Headache, Migraine, Nausea, Neck pain","Hospitalization, Other Serious or Important Medical Event"
9/28/2023,2023-CFS-010468,8/12/2023,SUSPECT,XYNGULAR XYNG,54,Vit/Min/Prot/Unconv Diet(Human/Animal),,,Female,"Headache, Migraine, Nausea, Neck pain","Hospitalization, Other Serious or Important Medical Event"
9/28/2023,2023-CFS-010468,8/12/2023,SUSPECT,XYNGULAR TRIMSTIX FRUIT PUNCH,54,Vit/Min/Prot/Unconv Diet(Human/Animal),,,Female,"Headache, Migraine, Nausea, Neck pain","Hospitalization, Other Serious or Important Medical Event"
9/28/2023,2023-CFS-010468,8/12/2023,SUSPECT,XYNGULAR RESIST CHEW,54,Vit/Min/Prot/Unconv Diet(Human/Animal),,,Female,"Headache, Migraine, Nausea, Neck pain","Hospitalization, Other Serious or Important Medical Event"
9/28/2023,2023-CFS-010468,8/12/2023,SUSPECT,XYNGULAR LEAN CHOCOLATE,54,Vit/Min/Prot/Unconv Diet(Human/Animal),,,Female,"Headache, Migraine, Nausea, Neck pain","Hospitalization, Other Serious or Important Medical Event"
9/28/2023,2023-CFS-010468,8/12/2023,SUSPECT,XYNGULAR FLUSH,54,Vit/Min/Prot/Unconv Diet(Human/Animal),,,Female,"Headache, Migraine, Nausea, Neck pain","Hospitalization, Other Serious or Important Medical Event"
9/28/2023,2023-CFS-010467,1/1/2023,SUSPECT,KACHAVA WHOLE BODY MEAL VANILLA,54,Vit/Min/Prot/Unconv Diet(Human/Animal),48,year(s),Male,"Amnesia, Dehydration, Hallucination","Hospitalization, Other Serious or Important Medical Event, Visited Emergency Room"
9/28/2023,2023-CFS-010465,,SUSPECT,JERGENS ULTRA HEALING MOISTURIZER,53,Cosmetics,,,,Infection,Other Serious or Important Medical Event
9/28/2023,2023-CFS-010464,9/27/2023,SUSPECT,TRACE MINERALS ONCENTRACE,54,Vit/Min/Prot/Unconv Diet(Human/Animal),34,year(s),Unknown,"Abdominal discomfort, Diarrhoea","Disability, Other Serious or Important Medical Event"
9/28/2023,2023-CFS-010464,9/27/2023,CONCOMITANT,Milk Thistle,54,Vit/Min/Prot/Unconv Diet(Human/Animal),34,year(s),Unknown,"Abdominal discomfort, Diarrhoea","Disability, Other Serious or Important Medical Event"
9/28/2023,2023-CFS-010464,9/27/2023,CONCOMITANT,"GNC mens multi vitamin, hair skin and nails",54,Vit/Min/Prot/Unconv Diet(Human/Animal),34,year(s),Unknown,"Abdominal discomfort, Diarrhoea","Disability, Other Serious or Important Medical Event"
9/28/2023,2023-CFS-010464,9/27/2023,CONCOMITANT,Fish oil,54,Vit/Min/Prot/Unconv Diet(Human/Animal),34,year(s),Unknown,"Abdominal discomfort, Diarrhoea","Disability, Other Serious or Important Medical Event"
9/28/2023,2023-CFS-010464,9/27/2023,CONCOMITANT,Ashwagandha,54,Vit/Min/Prot/Unconv Diet(Human/Animal),34,year(s),Unknown,"Abdominal discomfort, Diarrhoea","Disability, Other Serious or Important Medical Event"
9/28/2023,2023-CFS-010463,,SUSPECT,THC GUMMIES,33,Candy W/O Choc/Special/Chew Gum,4,year(s),,Malaise,"Hospitalization, Other Serious or Important Medical Event"
9/27/2023,2023-CFS-010393,9/27/2023,SUSPECT,CHOBANI FLIP COOKIES AND CREAM,9,Milk/Butter/Dried Milk Prod,11.6,year(s),Male,Tooth fracture,Other Serious or Important Medical Event
9/27/2023,2023-CFS-010392,9/7/2023,SUSPECT,KRATOM,54,Vit/Min/Prot/Unconv Diet(Human/Animal),36,year(s),Male,"Death, Overdose, Seizure","Death, Hospitalization"
9/27/2023,2023-CFS-010391,9/26/2023,SUSPECT,EOS LYCHEE AND WATERMELON FROSE DUO PACK,53,Cosmetics,35,year(s),Female,"Burning sensation, Lip pain, Lip swelling",Other Outcome
9/27/2023,2023-CFS-010390,9/26/2023,SUSPECT,IMPOSSIBLE MEATBALLS ITALIAN,37,Mult Food Dinner/Grav/Sauce/Special,58.2,year(s),Male,"Chills, Disorientation, Dizziness, Hyperhidrosis, Vomiting",Other Serious or Important Medical Event
9/27/2023,2023-CFS-010389,7/20/2021,SUSPECT,KRATOM SPACE DUST,54,Vit/Min/Prot/Unconv Diet(Human/Animal),39,year(s),Female,"Death, Overdose",Death
9/27/2023,2023-CFS-010381,,SUSPECT,CULTURELLE PROBIOTIC + PREBIOTIC GUMMIES,54,Vit/Min/Prot/Unconv Diet(Human/Animal),,,Female,"Constipation, Haematochezia","Life Threatening, Other Serious or Important Medical Event"
9/27/2023,2023-CFS-010380,8/1/2023,SUSPECT,AG1 WHOLE FOOD DIETARY SUPPLEMENT,54,Vit/Min/Prot/Unconv Diet(Human/Animal),36,year(s),Male,"Abdominal pain, Appendicitis","Other Serious or Important Medical Event, Visited Emergency Room, Visited a Health Care Provider"
9/27/2023,2023-CFS-010379,,SUSPECT,CENTRUM SILVER MEN'S 50+,54,Vit/Min/Prot/Unconv Diet(Human/Animal),,,,Foreign body in throat,Other Serious Outcome
9/27/2023,2023-CFS-010378,,SUSPECT,CENTRUM SILVER ADULTS 50+,54,Vit/Min/Prot/Unconv Diet(Human/Animal),53,year(s),,Choking,"Other Serious or Important Medical Event, Other Serious Outcome"
9/27/2023,2023-CFS-010376,9/1/2023,SUSPECT,ATHLETIC GREENS WHOLE FOOD DIETARY SUPPLEMENT,54,Vit/Min/Prot/Unconv Diet(Human/Animal),28,year(s),Male,Hepatic enzyme increased,"Other Serious or Important Medical Event, Other Serious Outcome"
9/27/2023,2023-CFS-010376,9/1/2023,CONCOMITANT,multi-vitamin,54,Vit/Min/Prot/Unconv Diet(Human/Animal),28,year(s),Male,Hepatic enzyme increased,"Other Serious or Important Medical Event, Other Serious Outcome"
9/27/2023,2023-CFS-010374,9/7/2023,SUSPECT,TAPEE TEA,31,Coffee/Tea,76,year(s),Male,"Atrial fibrillation, Dyspepsia, Haematochezia",Other Serious or Important Medical Event
9/27/2023,2023-CFS-010374,9/7/2023,CONCOMITANT,b-COMPLEX,54,Vit/Min/Prot/Unconv Diet(Human/Animal),76,year(s),Male,"Atrial fibrillation, Dyspepsia, Haematochezia",Other Serious or Important Medical Event
9/27/2023,2023-CFS-010374,9/7/2023,CONCOMITANT,ZINC,54,Vit/Min/Prot/Unconv Diet(Human/Animal),76,year(s),Male,"Atrial fibrillation, Dyspepsia, Haematochezia",Other Serious or Important Medical Event
9/27/2023,2023-CFS-010374,9/7/2023,CONCOMITANT,D,54,Vit/Min/Prot/Unconv Diet(Human/Animal),76,year(s),Male,"Atrial fibrillation, Dyspepsia, Haematochezia",Other Serious or Important Medical Event
9/27/2023,2023-CFS-010373,,SUSPECT,TRADER JOE'S NATURAL MOUNTAIN SPRING WATER,29,Soft Drink/Water,,,Female,"Dysgeusia, Nausea",Other Serious or Important Medical Event
9/27/2023,2023-CFS-010371,9/26/2023,SUSPECT,LUCKY CHARMS,5,Cereal Prep/Breakfast Food,36,year(s),Male,"Diarrhoea, Vomiting",Other Serious or Important Medical Event
9/27/2023,2023-CFS-010368,8/4/2023,SUSPECT,COCONUT SECRET COCONUT AMINOS,27,Dressing/Condiment,50,year(s),Not Reported,"Rash, Swelling",Disability
9/27/2023,2023-CFS-010367,1/21/2021,SUSPECT,CHEEZ-IT,7,Snack Food Item,65,year(s),Female,Hypersensitivity,"Hospitalization, Other Serious or Important Medical Event, Allergic Reaction"
9/27/2023,2023-CFS-010366,,SUSPECT,COTTONSEED OIL,26,Vegetable Oils,,,,Hypersensitivity,Allergic Reaction
9/26/2023,2023-CFS-010318,7/15/2023,SUSPECT,NATURE MADE ASHWAGANDA,54,Vit/Min/Prot/Unconv Diet(Human/Animal),24,year(s),Female,"Abnormal faeces, Alanine aminotransferase increased, Aspartate aminotransferase increased, Blood cholesterol increased, Cholesterosis, Fatigue, Muscle spasms, Vitamin B12 increased",Other Serious Outcome
9/26/2023,2023-CFS-010318,7/15/2023,CONCOMITANT,Vitamin D,54,Vit/Min/Prot/Unconv Diet(Human/Animal),24,year(s),Female,"Abnormal faeces, Alanine aminotransferase increased, Aspartate aminotransferase increased, Blood cholesterol increased, Cholesterosis, Fatigue, Muscle spasms, Vitamin B12 increased",Other Serious Outcome
9/26/2023,2023-CFS-010313,9/26/2023,SUSPECT,VARIOUS FOODS,37,Mult Food Dinner/Grav/Sauce/Special,40,year(s),Female,"Diarrhoea, Erythema, Malaise, Rash, Vomiting","Disability, Other Serious or Important Medical Event"
9/26/2023,2023-CFS-010294,9/3/2023,SUSPECT,BIFIDOBACTERIUM INFANTIS EVIVO ORAL SUSPENSION,54,Vit/Min/Prot/Unconv Diet(Human/Animal),4,day(s),Female,"Abdominal distension, Intestinal perforation, Sepsis",Hospitalization
9/26/2023,2023-CFS-010292,,SUSPECT,CHEEZ IT,7,Snack Food Item,32,year(s),Female,"Hypersensitivity, Panic attack, Urticaria",Allergic Reaction
9/26/2023,2023-CFS-010290,8/10/2023,SUSPECT,NATERRA FORTE,54,Vit/Min/Prot/Unconv Diet(Human/Animal),,,Male,Cushing's syndrome,"Hospitalization, Disability, Other Serious or Important Medical Event"
9/26/2023,2023-CFS-010289,8/28/2023,SUSPECT,XYMOGEN ACTIVNUTRIENTS WITHOUT IRON,54,Vit/Min/Prot/Unconv Diet(Human/Animal),61,year(s),Female,"Blood glucose increased, Blood pressure increased, Blood thyroid stimulating hormone increased, Deafness, Heart rate increased, Tinnitus","Hospitalization, Other Serious or Important Medical Event, Visited Emergency Room"
9/26/2023,2023-CFS-010289,8/28/2023,CONCOMITANT,omega 3,54,Vit/Min/Prot/Unconv Diet(Human/Animal),61,year(s),Female,"Blood glucose increased, Blood pressure increased, Blood thyroid stimulating hormone increased, Deafness, Heart rate increased, Tinnitus","Hospitalization, Other Serious or Important Medical Event, Visited Emergency Room"
9/26/2023,2023-CFS-010289,8/28/2023,CONCOMITANT,multivitamin,54,Vit/Min/Prot/Unconv Diet(Human/Animal),61,year(s),Female,"Blood glucose increased, Blood pressure increased, Blood thyroid stimulating hormone increased, Deafness, Heart rate increased, Tinnitus","Hospitalization, Other Serious or Important Medical Event, Visited Emergency Room"
9/26/2023,2023-CFS-010289,8/28/2023,CONCOMITANT,magnesium orotate,54,Vit/Min/Prot/Unconv Diet(Human/Animal),61,year(s),Female,"Blood glucose increased, Blood pressure increased, Blood thyroid stimulating hormone increased, Deafness, Heart rate increased, Tinnitus","Hospitalization, Other Serious or Important Medical Event, Visited Emergency Room"
9/26/2023,2023-CFS-010289,8/28/2023,CONCOMITANT,coenzyme Q10,54,Vit/Min/Prot/Unconv Diet(Human/Animal),61,year(s),Female,"Blood glucose increased, Blood pressure increased, Blood thyroid stimulating hormone increased, Deafness, Heart rate increased, Tinnitus","Hospitalization, Other Serious or Important Medical Event, Visited Emergency Room"
9/26/2023,2023-CFS-010289,8/28/2023,CONCOMITANT,Vitamin b12,54,Vit/Min/Prot/Unconv Diet(Human/Animal),61,year(s),Female,"Blood glucose increased, Blood pressure increased, Blood thyroid stimulating hormone increased, Deafness, Heart rate increased, Tinnitus","Hospitalization, Other Serious or Important Medical Event, Visited Emergency Room"
9/26/2023,2023-CFS-010289,8/28/2023,CONCOMITANT,Vitamin C,54,Vit/Min/Prot/Unconv Diet(Human/Animal),61,year(s),Female,"Blood glucose increased, Blood pressure increased, Blood thyroid stimulating hormone increased, Deafness, Heart rate increased, Tinnitus","Hospitalization, Other Serious or Important Medical Event, Visited Emergency Room"
9/26/2023,2023-CFS-010289,8/28/2023,CONCOMITANT,Ultimate PC+ Liver and Brain health,54,Vit/Min/Prot/Unconv Diet(Human/Animal),61,year(s),Female,"Blood glucose increased, Blood pressure increased, Blood thyroid stimulating hormone increased, Deafness, Heart rate increased, Tinnitus","Hospitalization, Other Serious or Important Medical Event, Visited Emergency Room"
9/26/2023,2023-CFS-010289,8/28/2023,SUSPECT,XYMOGEN OSSOPAN 1100 WITH D3 AND K2,54,Vit/Min/Prot/Unconv Diet(Human/Animal),61,year(s),Female,"Blood glucose increased, Blood pressure increased, Blood thyroid stimulating hormone increased, Deafness, Heart rate increased, Tinnitus","Hospitalization, Other Serious or Important Medical Event, Visited Emergency Room"
9/26/2023,2023-CFS-010289,8/28/2023,SUSPECT,XYMOGEN OPTIFIBER LEAN,54,Vit/Min/Prot/Unconv Diet(Human/Animal),61,year(s),Female,"Blood glucose increased, Blood pressure increased, Blood thyroid stimulating hormone increased, Deafness, Heart rate increased, Tinnitus","Hospitalization, Other Serious or Important Medical Event, Visited Emergency Room"
9/26/2023,2023-CFS-010289,8/28/2023,SUSPECT,XYMOGEN LIVER PROTECT,54,Vit/Min/Prot/Unconv Diet(Human/Animal),61,year(s),Female,"Blood glucose increased, Blood pressure increased, Blood thyroid stimulating hormone increased, Deafness, Heart rate increased, Tinnitus","Hospitalization, Other Serious or Important Medical Event, Visited Emergency Room"
9/26/2023,2023-CFS-010289,8/28/2023,SUSPECT,XYMOGEN LIPOTROPIX,54,Vit/Min/Prot/Unconv Diet(Human/Animal),61,year(s),Female,"Blood glucose increased, Blood pressure increased, Blood thyroid stimulating hormone increased, Deafness, Heart rate increased, Tinnitus","Hospitalization, Other Serious or Important Medical Event, Visited Emergency Room"
9/26/2023,2023-CFS-010289,8/28/2023,SUSPECT,XYMOGEN DIMENSION 3,54,Vit/Min/Prot/Unconv Diet(Human/Animal),61,year(s),Female,"Blood glucose increased, Blood pressure increased, Blood thyroid stimulating hormone increased, Deafness, Heart rate increased, Tinnitus","Hospitalization, Other Serious or Important Medical Event, Visited Emergency Room"
9/26/2023,2023-CFS-010289,8/28/2023,SUSPECT,XYMOGEN CINNDROMEX,54,Vit/Min/Prot/Unconv Diet(Human/Animal),61,year(s),Female,"Blood glucose increased, Blood pressure increased, Blood thyroid stimulating hormone increased, Deafness, Heart rate increased, Tinnitus","Hospitalization, Other Serious or Important Medical Event, Visited Emergency Room"
9/26/2023,2023-CFS-010289,8/28/2023,SUSPECT,XYMOGEN BERBERINE,54,Vit/Min/Prot/Unconv Diet(Human/Animal),61,year(s),Female,"Blood glucose increased, Blood pressure increased, Blood thyroid stimulating hormone increased, Deafness, Heart rate increased, Tinnitus","Hospitalization, Other Serious or Important Medical Event, Visited Emergency Room"
9/26/2023,2023-CFS-010288,,SUSPECT,UQORA DEFEND,54,Vit/Min/Prot/Unconv Diet(Human/Animal),,,,"Nephrolithiasis, Ureteric stenosis",Other Serious or Important Medical Event
9/26/2023,2023-CFS-010288,,CONCOMITANT,UQORA PROMOTE,54,Vit/Min/Prot/Unconv Diet(Human/Animal),,,,"Nephrolithiasis, Ureteric stenosis",Other Serious or Important Medical Event
9/26/2023,2023-CFS-010288,,CONCOMITANT,UQORA PROMOTE,54,Vit/Min/Prot/Unconv Diet(Human/Animal),,,,"Nephrolithiasis, Ureteric stenosis",Other Serious or Important Medical Event
9/26/2023,2023-CFS-010288,,CONCOMITANT,UQORA PROMOTE,54,Vit/Min/Prot/Unconv Diet(Human/Animal),,,,"Nephrolithiasis, Ureteric stenosis",Other Serious or Important Medical Event
9/26/2023,2023-CFS-010288,,CONCOMITANT,UQORA FLUSH,54,Vit/Min/Prot/Unconv Diet(Human/Animal),,,,"Nephrolithiasis, Ureteric stenosis",Other Serious or Important Medical Event
9/26/2023,2023-CFS-010288,,CONCOMITANT,UQORA FLUSH,54,Vit/Min/Prot/Unconv Diet(Human/Animal),,,,"Nephrolithiasis, Ureteric stenosis",Other Serious or Important Medical Event
9/26/2023,2023-CFS-010287,1/1/2023,SUSPECT,EQUELLE,54,Vit/Min/Prot/Unconv Diet(Human/Animal),66,year(s),Female,Oestradiol increased,Other Serious or Important Medical Event
9/26/2023,2023-CFS-010286,1/1/2023,SUSPECT,NATUREMADE SAM-E ADVANCED,54,Vit/Min/Prot/Unconv Diet(Human/Animal),,,Female,"Adverse event, Hyperparathyroidism, Vision blurred",Other Serious or Important Medical Event
9/26/2023,2023-CFS-010285,6/10/2020,SUSPECT,ONE A DAY WOMEN'S,54,Vit/Min/Prot/Unconv Diet(Human/Animal),44,year(s),Female,Foreign body in throat,Other Serious or Important Medical Event
9/26/2023,2023-CFS-010284,,SUSPECT,LIVING ESSENTIALS 5 HOUR ENERGY,54,Vit/Min/Prot/Unconv Diet(Human/Animal),,,Male,Death,"Death, Other Serious or Important Medical Event"
9/26/2023,2023-CFS-010283,,SUSPECT,LIVING ESSENTIALS 5 HOUR ENERGY,54,Vit/Min/Prot/Unconv Diet(Human/Animal),,,Female,Death,"Death, Other Serious or Important Medical Event"
9/26/2023,2023-CFS-010282,9/22/2023,SUSPECT,KIRKLAND SIGNATURE PRO CARE INFANT FORMULA,40P,Powder Formula,10,month(s),Male,Vomiting,Other Serious or Important Medical Event
9/26/2023,2023-CFS-010280,,SUSPECT,PRESERVISION AREDS 2,54,Vit/Min/Prot/Unconv Diet(Human/Animal),88,year(s),Female,"Macular degeneration, Neovascular age-related macular degeneration",Other Serious or Important Medical Event
9/26/2023,2023-CFS-010279,8/1/2023,SUSPECT,PRESERVISION AREDS 2,54,Vit/Min/Prot/Unconv Diet(Human/Animal),,,Male,Death,Death
9/26/2023,2023-CFS-010275,8/12/2023,SUSPECT,ATHLETIC GREENS WHOLE FOOD DIETARY SUPPLEMENT POWDER,54,Vit/Min/Prot/Unconv Diet(Human/Animal),63,year(s),Female,"Flank pain, Nephrolithiasis, Pollakiuria, Urine output decreased",Other Serious Outcome
9/26/2023,2023-CFS-010274,9/25/2023,SUSPECT,JUVIA'S PLACE BRONZED MINI LIQUID LIPSTICK,53,Cosmetics,19.3,year(s),Female,"Lip pain, Rash, Swelling",Other Outcome
9/26/2023,2023-CFS-010272,,SUSPECT,NUTRAFOL WOMEN'S BALANCE,54,Vit/Min/Prot/Unconv Diet(Human/Animal),63,year(s),Female,"Bradycardia, Dizziness","Other Serious or Important Medical Event, Visited Emergency Room, Other Serious Outcome"
9/26/2023,2023-CFS-010271,,SUSPECT,LINDBERG ULTRA BRAIN SUPPORT,54,Vit/Min/Prot/Unconv Diet(Human/Animal),,,Female,"Constipation, Urinary tract infection","Hospitalization, Other Serious or Important Medical Event"
9/26/2023,2023-CFS-010270,,SUSPECT,PURE ENCAPSULATIONS MEN S NUTRIENTS CAPSULES,54,Vit/Min/Prot/Unconv Diet(Human/Animal),59,year(s),Male,"Illness, Loss of consciousness",Other Serious or Important Medical Event
9/25/2023,2023-CFS-010345,,SUSPECT,DIET COLA,29,Soft Drink/Water,,,Female,Vulvovaginal burning sensation,Other Serious or Important Medical Event
9/25/2023,2023-CFS-010259,4/6/2023,SUSPECT,ESSENCE LASH PRINCESS FALSE LASH EFFECT WATERPROOF VOLUMIZING MASCARA,53,Cosmetics,,,Female,"Burning sensation, Infection, Inflammation, Pain, Scar, Vision blurred","Hospitalization, Other Serious or Important Medical Event, Visited Emergency Room"
9/25/2023,2023-CFS-010220,9/21/2023,SUSPECT,CEREBELLY SMART BARS STRAWBERRY BEET,41,Dietary Conventional Foods/Meal Replacements,8,month(s),Male,Diarrhoea,Other Serious or Important Medical Event
9/25/2023,2023-CFS-010218,8/1/2023,SUSPECT,HERBAL ESSENCES SULFATE FREE HONEY & VITAMIN B DAILY MOISTURE HYDRATION SHAMPOO,53,Cosmetics,,,Female,Pruritus,Other Outcome
9/25/2023,2023-CFS-010217,9/24/2023,CONCOMITANT,Slimina weightloss capsules,54,Vit/Min/Prot/Unconv Diet(Human/Animal),23,year(s),Female,"Discharge, Insomnia, Irritability, Mood swings, Pruritus","Other Serious or Important Medical Event, Other Serious Outcome"
9/25/2023,2023-CFS-010217,9/24/2023,CONCOMITANT,BB lab gluta c (orange),54,Vit/Min/Prot/Unconv Diet(Human/Animal),23,year(s),Female,"Discharge, Insomnia, Irritability, Mood swings, Pruritus","Other Serious or Important Medical Event, Other Serious Outcome"
9/25/2023,2023-CFS-010217,9/24/2023,CONCOMITANT,BB lab collagen (pink),54,Vit/Min/Prot/Unconv Diet(Human/Animal),23,year(s),Female,"Discharge, Insomnia, Irritability, Mood swings, Pruritus","Other Serious or Important Medical Event, Other Serious Outcome"
9/25/2023,2023-CFS-010217,9/24/2023,SUSPECT,SLIMINA WEIGHTLOSS CAPSULES 30 CAPS,54,Vit/Min/Prot/Unconv Diet(Human/Animal),23,year(s),Female,"Discharge, Insomnia, Irritability, Mood swings, Pruritus","Other Serious or Important Medical Event, Other Serious Outcome"
9/25/2023,2023-CFS-010214,1/1/2020,SUSPECT,DAILY ESSENTIAL NUTRIENTS BY HARDY NUTRITIONALS,54,Vit/Min/Prot/Unconv Diet(Human/Animal),30,year(s),Male,Gastrointestinal pain,Other Serious Outcome
9/25/2023,2023-CFS-010214,1/1/2020,CONCOMITANT,fish oil,54,Vit/Min/Prot/Unconv Diet(Human/Animal),30,year(s),Male,Gastrointestinal pain,Other Serious Outcome